gmp build test failure

Michael LeVine mlevine at
Thu Oct 10 12:40:53 UTC 2019

Downloaded via fink gmp5  6.1.2 onto my Mac running MACOS Catalina
build ran tests and failed one

PASS: t-asmtype
PASS: t-aors_1
PASS: t-divrem_1
PASS: t-mod_1
PASS: t-fat
PASS: t-get_d
PASS: t-instrument
PASS: t-iord_u
PASS: t-mp_bases
PASS: t-perfsqr
PASS: t-scan
PASS: logic
PASS: t-toom22
PASS: t-toom32
PASS: t-toom33
PASS: t-toom42
PASS: t-toom43
PASS: t-toom44
PASS: t-toom52
../../../test-driver: line 107: 25765 Segmentation fault: 11  "$@" > $log_file 2>&1
FAIL: t-toom53
PASS: t-toom54
PASS: t-toom62
PASS: t-toom63
PASS: t-toom6h
PASS: t-toom8h
PASS: t-toom2-sqr
PASS: t-toom3-sqr
PASS: t-toom4-sqr
PASS: t-toom6-sqr
PASS: t-toom8-sqr
PASS: t-div
PASS: t-mul
PASS: t-mullo
PASS: t-sqrlo
PASS: t-mulmod_bnm1
PASS: t-sqrmod_bnm1
PASS: t-mulmid
PASS: t-hgcd
PASS: t-hgcd_appr
PASS: t-matrix22
PASS: t-invert
PASS: t-bdiv
PASS: t-broot
PASS: t-brootinv
PASS: t-minvert
PASS: t-sizeinbase
Testsuite summary for GNU MP 6.1.2
# TOTAL: 46
# PASS:  45
# SKIP:  0
# XFAIL: 0
# FAIL:  1
# XPASS: 0
# ERROR: 0
See tests/mpn/test-suite.log
Please report to gmp-bugs at, see
make[5]: *** [test-suite.log] Error 1
make[4]: *** [check-TESTS] Error 2
make[3]: *** [check-am] Error 2
make[2]: *** [check-recursive] Error 1
make[1]: *** [check-recursive] Error 1
make: *** [check] Error 2
### execution of /tmp/fink.RWd4f failed, exit code 2
### execution of /tmp/fink.GPiRs failed, exit code 2
Removing runtime build-lock...
Removing build-lock package...
/opt/sw/bin/dpkg-lockwait -r fink-buildlock-gmp5-6.1.2-1
(Reading database ... 7429 files and directories currently installed.)
Removing fink-buildlock-gmp5-6.1.2-1 ...
Failed: phase compiling: gmp5-6.1.2-1 failed

Michael LeVine
mlevine at

Politics is the art of looking for trouble,
finding it everywhere,
diagnosing it incorrectly,
and applying the wrong remedies.
		Groucho Marx

More information about the gmp-bugs mailing list