gmp compile fail

Torbjörn Granlund tg at
Mon May 5 20:17:14 UTC 2014

Eric Rupert <ogrebeer at> writes:

  To whom it may concern,
  /bin/bash: line 4: 14074 Segmentation fault      (core dumped) ${dir}$tst
  FAIL: t-scan
  1 of 58 tests failed
  Please report to gmp-bugs at
  make[4]: *** [check-TESTS] Error 1
  make[4]: Leaving directory `/opt/gmp-4.3.2/tests/mpz'
  make[3]: *** [check-am] Error 2
  make[3]: Leaving directory `/opt/gmp-4.3.2/tests/mpz'
  make[2]: *** [check-recursive] Error 1
  make[2]: Leaving directory `/opt/gmp-4.3.2/tests'
  make[1]: *** [check-recursive] Error 1
  make[1]: Leaving directory `/opt/gmp-4.3.2'
  make: *** [check] Error 2
  Also, I have no idea how to make it work
I think this is expected.  GMP has not ter been ported to the Frobnic.

(If my guess that you're using a Frobnic is wrong, please provide some
data for us to make a more educated guess, see

Please encrypt, key id 0xC8601622

More information about the gmp-bugs mailing list