gmp compile fail

Eric Rupert ogrebeer at
Mon May 5 18:41:20 UTC 2014

To whom it may concern,

/bin/bash: line 4: 14074 Segmentation fault      (core dumped) ${dir}$tst
FAIL: t-scan

1 of 58 tests failed
Please report to gmp-bugs at
make[4]: *** [check-TESTS] Error 1
make[4]: Leaving directory `/opt/gmp-4.3.2/tests/mpz'
make[3]: *** [check-am] Error 2
make[3]: Leaving directory `/opt/gmp-4.3.2/tests/mpz'
make[2]: *** [check-recursive] Error 1
make[2]: Leaving directory `/opt/gmp-4.3.2/tests'
make[1]: *** [check-recursive] Error 1
make[1]: Leaving directory `/opt/gmp-4.3.2'
make: *** [check] Error 2

Also, I have no idea how to make it work


More information about the gmp-bugs mailing list