macOS Catalina: FAIL: t-powm

Cedric Berger cedric at
Fri Nov 1 14:58:50 UTC 2019


This is a fresh XCode 11.2 (11B52) and Catalina 10.15.1 (19B88)

What could I do?

$ which cc
$ cc -v
Apple clang version 11.0.0 (clang-1100.0.33.12)
Target: x86_64-apple-darwin19.0.0
Thread model: posix
$ uname -a
Darwin Cedrics-New-MBP.local 19.0.0 Darwin Kernel Version 19.0.0: Thu 
Oct 17 16:17:15 PDT 2019; root:xnu-6153.41.3~29/RELEASE_X86_64 x86_64$ 
$ ./configfsf.guess

/Applications/ check-TESTS
PASS: reuse
PASS: t-addsub
PASS: t-cmp
PASS: t-mul
PASS: t-mul_i
PASS: t-tdiv
PASS: t-tdiv_ui
PASS: t-fdiv
PASS: t-fdiv_ui
PASS: t-cdiv_ui
PASS: t-gcd
PASS: t-gcd_ui
PASS: t-lcm
PASS: t-invert
PASS: dive
PASS: dive_ui
PASS: t-sqrtrem
PASS: convert
PASS: io
PASS: t-inp_str
PASS: logic
PASS: bit
../../../test-driver: line 107:  8902 Segmentation fault: 11  "$@" > 
$log_file 2>&1
FAIL: t-powm
PASS: t-powm_ui
PASS: t-pow
PASS: t-div_2exp
PASS: t-root
PASS: t-perfsqr
PASS: t-perfpow
PASS: t-jac
PASS: t-bin
PASS: t-get_d
PASS: t-get_d_2exp
PASS: t-get_si
PASS: t-set_d
PASS: t-set_si
PASS: t-fac_ui
PASS: t-mfac_uiui
PASS: t-primorial_ui
PASS: t-fib_ui
PASS: t-lucnum_ui
PASS: t-scan
PASS: t-fits
PASS: t-divis
PASS: t-divis_2exp
PASS: t-cong
PASS: t-cong_2exp
PASS: t-sizeinbase
PASS: t-set_str
PASS: t-aorsmul
PASS: t-cmp_d
PASS: t-cmp_si
PASS: t-hamdist
PASS: t-oddeven
PASS: t-popcount
PASS: t-set_f
PASS: t-io_raw
PASS: t-import
PASS: t-export
PASS: t-pprime_p
PASS: t-nextprime
PASS: t-remove
PASS: t-limbs
Testsuite summary for GNU MP 6.1.2
# TOTAL: 63
# PASS:  62
# SKIP:  0
# XFAIL: 0
# FAIL:  1
# XPASS: 0
# ERROR: 0
See tests/mpz/test-suite.log
Please report to gmp-bugs at, see
make[5]: *** [test-suite.log] Error 1
make[4]: *** [check-TESTS] Error 2
make[3]: *** [check-am] Error 2
make[2]: *** [check-recursive] Error 1
make[1]: *** [check-recursive] Error 1
make: *** [check] Error 2

More information about the gmp-bugs mailing list