make test failure

Michael Brooks mrbrooks at
Sun Oct 16 23:59:58 UTC 2016

To Whom it may concern,

PASS: t-get_d_2exp

PASS: t-get_si

PASS: t-set_d

PASS: t-set_si

PASS: t-fac_ui

PASS: t-fib_ui

PASS: t-lucnum_ui

/bin/bash: line 5:  5510 Segmentation fault      ${dir}$tst

FAIL: t-scan

PASS: t-fits

PASS: t-divis

PASS: t-divis_2exp

PASS: t-cong

PASS: t-cong_2exp

PASS: t-sizeinbase

PASS: t-set_str

PASS: t-aorsmul

PASS: t-cmp_d

PASS: t-cmp_si

PASS: t-hamdist

PASS: t-oddeven

PASS: t-popcount

PASS: t-set_f

PASS: t-io_raw

PASS: t-import

PASS: t-export

PASS: t-pprime_p

PASS: t-nextprime


1 of 58 tests failed

Please report to gmp-bugs at


Makefile:1027: recipe for target 'check-TESTS' failed

make[4]: *** [check-TESTS] Error 1

make[4]: Leaving directory '/home/pi/src/gmp-5.0.2/tests/mpz'

Makefile:1149: recipe for target 'check-am' failed

make[3]: *** [check-am] Error 2

make[3]: Leaving directory '/home/pi/src/gmp-5.0.2/tests/mpz'

Makefile:555: recipe for target 'check-recursive' failed

make[2]: *** [check-recursive] Error 1

make[2]: Leaving directory '/home/pi/src/gmp-5.0.2/tests'

Makefile:923: recipe for target 'check-recursive' failed

make[1]: *** [check-recursive] Error 1

make[1]: Leaving directory '/home/pi/src/gmp-5.0.2'

Makefile:1231: recipe for target 'check' failed

make: *** [check] Error 2

t-scan test failed.



More information about the gmp-bugs mailing list