FAILED t-scan test of the arm-2009q3-67-arm-none-linux-gnueabi gmp-stable.

Albert Grigoryan albertgrigoryan11 at
Thu Jan 28 10:04:18 UTC 2016

When I test gmb-stable i see that fail.
What is the reason to that issue ?

steps are:
   cd gmp-stable/
   sudo make install
   make check

/bin/bash: line 4: 12685 Segmentation fault      (core dumped) ${dir}$tst
FAIL: t-scan
1 of 58 tests failed
Please report to gmp-bugs at
make[4]: *** [check-TESTS] Error 1
make[4]: Leaving directory
make[3]: *** [check-am] Error 2
make[3]: Leaving directory
make[2]: *** [check-recursive] Error 1
make[2]: Leaving directory
make[1]: *** [check-recursive] Error 1
make[1]: Leaving directory
make: *** [check] Error 2

Operating System: Ubuntu 14.04.3 LTS
                 Kernel: Linux 3.13.0-71-generic
         Architecture: x86_64

More information about the gmp-bugs mailing list