tg at tg at
Sat May 2 08:22:03 UTC 2015

Dogan <hakidoki at> writes:

  1 of 58 tests failed
  Please report to gmp-bugs at
  make[4]: *** [check-TESTS] Error 1
  make[4]: Leaving directory `/home/hakan/Downloads/gmp-4.3.2/tests/mpz'
  make[3]: *** [check-am] Error 2
  make[3]: Leaving directory `/home/hakan/Downloads/gmp-4.3.2/tests/mpz'
  make[2]: *** [check-recursive] Error 1
  make[2]: Leaving directory `/home/hakan/Downloads/gmp-4.3.2/tests'
  make[1]: *** [check-recursive] Error 1
  make[1]: Leaving directory `/home/hakan/Downloads/gmp-4.3.2'
  make: *** [check] Error 2
Thanks for this detailed bug report.

It is clear from your report that gmp 4.3.2 is too old to function
properly on your machine.  You either need to get an outdated computer,
or get a less outdated GMP release.

Please encrypt, key id 0xC8601622

More information about the gmp-bugs mailing list