1 of 58 test failed gcc-4.9 rc1

Kyle Bentley kwbent at uab.edu
Sun Apr 13 18:34:19 UTC 2014

I was testing the April 11 release candidate of gcc 4.9, and one of the
test (make check) had failed.  I was told by my terminal to report to
here, so I am.  Here is the relevant section:

make  check-TESTS
make[6]: Entering directory `/home/kyle/Software/g++/objdir/gmp/tests/mpz'
PASS: t-addsub
PASS: t-cmp
PASS: t-mul
PASS: t-mul_i
PASS: t-tdiv
PASS: t-tdiv_ui
PASS: t-fdiv
PASS: t-fdiv_ui
PASS: t-cdiv_ui
PASS: t-gcd
PASS: t-gcd_ui
PASS: t-lcm
PASS: dive
PASS: dive_ui
PASS: t-sqrtrem
PASS: convert
PASS: io
PASS: t-inp_str
PASS: logic
PASS: bit
PASS: t-powm
PASS: t-powm_ui
PASS: t-pow
PASS: t-div_2exp
PASS: reuse
PASS: t-root
PASS: t-perfsqr
PASS: t-perfpow
PASS: t-jac
PASS: t-bin
PASS: t-get_d
PASS: t-get_d_2exp
PASS: t-get_si
PASS: t-set_d
PASS: t-set_si
PASS: t-fac_ui
PASS: t-fib_ui
PASS: t-lucnum_ui
/bin/bash: line 4:  1347 Segmentation fault      ${dir}$tst
FAIL: t-scan
PASS: t-fits
PASS: t-divis
PASS: t-divis_2exp
PASS: t-cong
PASS: t-cong_2exp
PASS: t-sizeinbase
PASS: t-set_str
PASS: t-aorsmul
PASS: t-cmp_d
PASS: t-cmp_si
PASS: t-hamdist
PASS: t-oddeven
PASS: t-popcount
PASS: t-set_f
PASS: t-io_raw
PASS: t-import
PASS: t-export
PASS: t-pprime_p
PASS: t-nextprime
1 of 58 tests failed
Please report to gmp-bugs at gmplib.org
make[6]: *** [check-TESTS] Error 1
make[6]: Leaving directory `/home/kyle/Software/g++/objdir/gmp/tests/mpz'
make[5]: *** [check-am] Error 2
make[5]: Leaving directory `/home/kyle/Software/g++/objdir/gmp/tests/mpz'
make[4]: *** [check-recursive] Error 1
make[4]: Leaving directory `/home/kyle/Software/g++/objdir/gmp/tests'
make[3]: *** [check-recursive] Error 1
make[3]: Leaving directory `/home/kyle/Software/g++/objdir/gmp'
make[2]: *** [check] Error 2
make[2]: Leaving directory `/home/kyle/Software/g++/objdir/gmp'
make[1]: *** [check-gmp] Error 2
make[1]: Leaving directory `/home/kyle/Software/g++/objdir'
make: *** [do-check] Error 2

Kyle Bentley
-------------- next part --------------
A non-text attachment was scrubbed...
Name: 0x06851F38.asc
Type: application/pgp-keys
Size: 1714 bytes
Desc: not available
URL: <https://gmplib.org/list-archives/gmp-bugs/attachments/20140413/c53a467c/attachment.bin>

More information about the gmp-bugs mailing list