gnu GMP test error

Ware, John JWare at
Thu Mar 1 21:29:02 CET 2012

I encountered an error while building gmp-4.3.2, it occurred during 'make check'
per your request I am reporting this to you.

Mac Powerbook OS/X 10.7.3 2.8 GHz Intel Core 2 Duo
Apple Xcode 4.3

Please let me know if any other information would be helpful.

John Ware
Sr. Software Engineer
Church Pension Group
jware at
212-592-8294 office
445 Fifth Ave
New York City, N.Y. 10016

#last section of output from 'make check' follows

creating t-nextprime
make  check-TESTS
PASS: t-addsub
PASS: t-cmp
PASS: t-mul
PASS: t-mul_i
PASS: t-tdiv
PASS: t-tdiv_ui
PASS: t-fdiv
PASS: t-fdiv_ui
PASS: t-cdiv_ui
PASS: t-gcd
PASS: t-gcd_ui
PASS: t-lcm
PASS: dive
PASS: dive_ui
PASS: t-sqrtrem
PASS: convert
PASS: io
PASS: t-inp_str
PASS: logic
PASS: bit
PASS: t-powm
PASS: t-powm_ui
PASS: t-pow
PASS: t-div_2exp
PASS: reuse
PASS: t-root
PASS: t-perfsqr
PASS: t-perfpow
PASS: t-jac
PASS: t-bin
PASS: t-get_d
PASS: t-get_d_2exp
PASS: t-get_si
PASS: t-set_d
PASS: t-set_si
PASS: t-fac_ui
PASS: t-fib_ui
PASS: t-lucnum_ui
PASS: t-scan
PASS: t-fits
PASS: t-divis
PASS: t-divis_2exp
PASS: t-cong
PASS: t-cong_2exp
PASS: t-sizeinbase
PASS: t-set_str
PASS: t-aorsmul
PASS: t-cmp_d
PASS: t-cmp_si
/bin/sh: line 1: 44283 Segmentation fault: 11  ${dir}$tst
FAIL: t-hamdist
PASS: t-oddeven
/bin/sh: line 1: 44322 Segmentation fault: 11  ${dir}$tst
FAIL: t-popcount
PASS: t-set_f
PASS: t-io_raw
PASS: t-import
PASS: t-export
PASS: t-pprime_p
PASS: t-nextprime
2 of 58 tests failed
Please report to gmp-bugs at
make[4]: *** [check-TESTS] Error 1
make[3]: *** [check-am] Error 2
make[2]: *** [check-recursive] Error 1
make[1]: *** [check-recursive] Error 1
make: *** [check] Error 2

More information about the gmp-bugs mailing list