Bugs on mac lion

Xuanye An mathmillion518 at gmail.com
Tue Jul 17 20:01:16 CEST 2012


I am reporting some bugs on my mac as below.
And I was trying to install gmp-4.3.2 on mac, after "make install" there are something wrong happened.
So please tell me how to solve. 
Thank you very much

make[3]: *** [install-libLTLIBRARIES] Error 71
make[2]: *** [install-am] Error 2
make[1]: *** [install-recursive] Error 1
make: *** [install] Error 2

More information about the gmp-bugs mailing list