Bugs on mac lion

Xuanye An mathmillion518 at gmail.com
Wed Aug 1 02:43:05 CEST 2012

After make check, the errors happened as below.
The version is gmp-5.0.5.
Thank you

make[4]: *** [check-TESTS] Error 1
make[3]: *** [check-am] Error 2
make[2]: *** [check-recursive] Error 1
make[1]: *** [check-recursive] Error 1
make: *** [check] Error 2

On 18 Jul 2012, at 23:11, Hans Aberg wrote:

> [Please keep the cc to the list, so that others can follow the issue.]
> I have compiled it with the llvm-gcc that comes with Xcode, and also gmp-5.0.4 with clang that comes with Xcode, and a GCC 4.7 version that was compiled with one of those compilers. There may be other compilers that work. You cab download just the command line line tools if you so wish.
> Hans
> On 18 Jul 2012, at 23:40, Xuanye An wrote:
>> Hi Hans
>> Thank you for your reply.
>> I also tried to install the latest version gmp-5.0.5, which still some errors happened.
>> Must I install gmp with Xcode?
>> Thank you very much.
>> Best regards,
>> Xuanye

More information about the gmp-bugs mailing list