An error while building gmp

Torbjorn Granlund tg at
Fri Apr 13 15:06:50 CEST 2012

Emmanuel Federbusch <emmanuel at> writes:

  libtool: link: cannot find the library `../' or unhandled argument `../'
  make[4]: *** [] Error 1
  make[3]: *** [check-am] Error 2
  make[2]: *** [check-recursive] Error 1
  make[1]: *** [check-recursive] Error 1
  make: *** [check] Error 2

The last few lines of an apparent error message from an unknown build is
not enough information even for the greatest gurus out there, and
certainly not for us GMP hackers.

Please see and file a
proper bug report.


More information about the gmp-bugs mailing list