2 of 58 tests failed... reporting as requested

gtp gtp at lbl.gov
Fri Sep 17 19:19:58 CEST 2010

  2 of 58 tests failed
Please report to gmp-bugs at gmplib.org
make[4]: *** [check-TESTS] Error 1
make[4]: Leaving directory `/home/gtp/downloads/gmp-5.0.1/tests/mpz'
make[3]: *** [check-am] Error 2
make[3]: Leaving directory `/home/gtp/downloads/gmp-5.0.1/tests/mpz'
make[2]: *** [check-recursive] Error 1
make[2]: Leaving directory `/home/gtp/downloads/gmp-5.0.1/tests'
make[1]: *** [check-recursive] Error 1
make[1]: Leaving directory `/home/gtp/downloads/gmp-5.0.1'
make: *** [check] Error 2

The platform is a Dell 3500 running AMD64 Debian distribution.
My experience is engineering, not computing.  So I don't know
if these tests depend on some other library that isn't up to date or not.

gerald Przybylski

More information about the gmp-bugs mailing list