5.0.1 test failures on alphaev56-dec-osf4.0g (Tru64)

Daniel Richard G. skunk at iSKUNK.ORG
Sun Sep 5 10:07:01 CEST 2010

I get the following whether I build with the vendor compiler or GCC:

PASS: t-toom63
PASS: t-toom6h
PASS: t-toom8h
/usr/bin/bash: line 5:  4774 Segmentation fault      ${dir}$tst
FAIL: t-hgcd
PASS: t-matrix22
PASS: t-mullo
PASS: t-mulmod_bnm1
PASS: t-sqrmod_bnm1
/usr/bin/bash: line 5: 22648 Segmentation fault      ${dir}$tst
FAIL: t-invert
/usr/bin/bash: line 5:   511 Segmentation fault      ${dir}$tst
FAIL: t-div
PASS: t-bdiv
3 of 30 tests failed
Please report to gmp-bugs at gmplib.org
gmake[4]: *** [check-TESTS] Error 1
gmake[4]: Leaving directory `/tmp/gmp-5.0.1.build/tests/mpn'
gmake[3]: *** [check-am] Error 2
gmake[3]: Leaving directory `/tmp/gmp-5.0.1.build/tests/mpn'
gmake[2]: *** [check-recursive] Error 1
gmake[2]: Leaving directory `/tmp/gmp-5.0.1.build/tests'
gmake[1]: *** [check-recursive] Error 1
gmake[1]: Leaving directory `/tmp/gmp-5.0.1.build'
gmake: *** [check] Error 2


NAME = Daniel Richard G.     _\|/_    Remember, skunks
MAIL = skunk at iSKUNK.ORG     (/o|o\) _- don't smell bad---
MAIL+= skunk at alum.MIT.EDU   < (^),>     it's the people who
WWW  = (not there yet!)      /   \      annoy us that do!

More information about the gmp-bugs mailing list