Installation Errors in gmp

Gun Woo Kim gunwoo_kim at
Mon Jul 2 08:51:02 CEST 2007

There are some errors which occurs during installation on mac osx  
(unix based system).

$ sudo make check
make  check-recursive
Making check in tests
Making check in .
make t-bswap t-constants t-count_zeros t-gmpmax t- 
hightomask t-modlinv t-popc t-parity t-sub
make[4]: `' is up to date.
/bin/sh ../libtool --mode=link gcc  -m32 -O2 -fomit-frame-pointer - 
mtune=pentium3 -march=pentium3   -o t-bswap  t-bswap.o ../
gcc -m32 -O2 -fomit-frame-pointer -mtune=pentium3 -march=pentium3 -o  
t-bswap t-bswap.o  ./.libs/libtests.a /Users/reshout/gmp-4.2.1/.libs/ 
libgmp.a ../.libs/libgmp.a
/usr/bin/ld: Undefined symbols:
collect2: ld returned 1 exit status
make[4]: *** [t-bswap] Error 1
make[3]: *** [check-am] Error 2
make[2]: *** [check-recursive] Error 1
make[1]: *** [check-recursive] Error 1
make: *** [check] Error 2

Gun Woo Kim
Associate Researcher
R&D Center / Core Dept.
TmaxSoft Co., Ltd.

-------------- next part --------------
An HTML attachment was scrubbed...

More information about the gmp-bugs mailing list