"reuse" test failure on PowerPC G5

Mossinghoff, Michael mimossinghoff at davidson.edu
Thu Feb 8 15:36:58 CET 2007


I was installing GMP 4.2.1 on a PowerMac G5 (PowerPC 970, dual 2 GHz, 2GB
memory), and received an error on the "make check":

1 of 56 tests failed
Please report to gmp-bugs at swox.com
make[4]: *** [check-TESTS] Error 1
make[3]: *** [check-am] Error 2
make[2]: *** [check-recursive] Error 1
make[1]: *** [check-recursive] Error 1
make: *** [check] Error 2

FAIL: reuse

Here is information on the compiler:

mjm:~/gmp-4.2.1$ gcc -v
Using built-in specs.
Target: powerpc-apple-darwin8
Configured with: /private/var/tmp/gcc/gcc-5341.obj~1/src/configure
--disable-checking -enable-werror --prefix=/usr --mandir=/share/man
--with-gxx-include-dir=/include/c++/4.0.0 --with-slibdir=/usr/lib
--build=powerpc-apple-darwin8 --host=powerpc-apple-darwin8
Thread model: posix
gcc version 4.0.1 (Apple Computer, Inc. build 5341)


Michael Mossinghoff

More information about the gmp-bugs mailing list