installation error

Oswald oasf2004 at
Sun Mar 14 22:33:30 CET 2004

Dear Group,
After running make check I got the following error message:

This application has requested the Runtime to terminate it in an unusual way.

Please contact the application's support team for more information.

FAIL: t-io_raw.exe

PASS: t-import.exe

PASS: t-export.exe


1 of 52 tests failed


make[3]: *** [check-TESTS] Error 1

make[3]: Leaving directory `/c/quincy2002/mingw/lib/gmp-4.1.2/tests/mpz'

make[2]: *** [check-am] Error 2

make[2]: Leaving directory `/c/quincy2002/mingw/lib/gmp-4.1.2/tests/mpz'

make[1]: *** [check-recursive] Error 1

make[1]: Leaving directory `/c/quincy2002/mingw/lib/gmp-4.1.2/tests'

make: *** [check-recursive] Error 1


My machine is a Pentium 4; operational: system Windows XP; used compiler: MinGW with SYS. 

Could anyone, please,  send me a hint?



Do you Yahoo!?
Yahoo! Mail - More reliable, more storage, less spam
-------------- next part --------------
An HTML attachment was scrubbed...
URL: /list-archives/gmp-bugs/attachments/20040314/043304d2/attachment.htm

More information about the gmp-bugs mailing list